{"text_format":"3","workbook":"xlsx","n_sheets":8,"sheets":["I1_Erläuterung","E1_Projektdaten","E2_Wärmepreis","E3_Verbraucher","B1_Berechnungen","A1_Ergebnisse","A2_Planerfolgsrechnung","A9_NPV-Daten"],"not_rendered":{"charts":6,"images":5,"external_links":1,"defined_names":467,"comments":1},"read":"whole","date_system":"1900"}

{"sheet":"I1_Erläuterung","index":0,"n_rows":289,"n_cols":2,"rows_kept":289}
[null,"Erläuterungen zum QM Holzheizwerke Wirtschaftlichkeitstool"]
[null,"Version: 6 EUR (August 2025)"]
[null,"Erläuterung"]
[null,"Prinzipielles zu diesem Werkzeug:\nHaftungsausschluss\nDas Excel-Werkzeug wurde sehr sorgfältig erstellt, trotzdem können die Hersteller keinerlei Garantie oder Gewährleistung für die ermittelten Ergebnisse und daraus abgeleitete Schlüsse übernehmen. Durch die getroffenen Vereinfachungen ergeben sich aufgrund der Art der Berechnung bestimmte \"Fehler\", z.B. wird nicht berücksichtigt, ob eine Zahlung zu Jahresbeginn oder Jahresende erfolgt, da ein Jahr als eine Periode angesehen wird.\nAchtung: Auch wenn Warnungs-Rückmeldungen bezüglich diverser Eingabegrenzen durch das Werkzeug erfolgen, ist nicht auszuschliessen, dass durch falsche Eingabewerte eine falsche Darstellung des Endergebnisses erfolgt. Die richtige Abschätzung der Folgen bestimmter Annahmen obliegt dem Benutzer des Werkzeugs.\n\nFormeln:\nDie Arbeitsblätter dieser Arbeitsmappe sind mit einem Schreibschutz gesichert, alle Formeln und Berechnungen sind jedoch ersichtlich. Bitte beachten Sie, dass Änderungen daran zu Fehlern an anderen Stellen und damit zu falschen Aussagen des Werkzeugs führen können.\n\nSensitivitätsanalyse / Was-Wäre-Wenn Rechnung:\nDurch Variation der Eingabeparameter und Speicherung der einzelnen Ergebnisse der \nWirtschaftlichkeitsberechnung ist es möglich, Aussagen bezüglich des Einflusses einzelner \nParameter auf die wirtschaftliche Entwicklung des Projekts zu erhalten.\n\nFeedback:\nDas Team von QM Holzheizwerke freut sich über Verbesserungsvorschläge und Anregungen zu \ndiesem Werkzeug, bitte übermitteln Sie diese an info@qmholzheizwerke.ch"]
[null,"Dank\nDie Erstellung des vorliegenden Werkzeuges erfolgte im Auftrag von Energieschweiz. Die Weiterentwicklung ermöglichte Holzenergie Schweiz und die Arbeitsgemeinschaft QM Holzheizwerke."]
[null,"Registerblätter: Die Datei ist aufgeteilt auf verschiedene Registerblätter\nBenennung: Die Benennung der Registerblätter unterscheidet auch die hauptsächliche Funktion des Arbeitsblattes:\nI = Information (Arbeitsblatt enthält Infos und Erläuterungen zur Anwendung der Datei)\nE = Eingabeblatt (Eingabe von Daten, die für die Berechnung notwendig sind)\nB = Berechnung\nA = Ausgabeblatt (Darstellung von ausgewählten Ergebnissen zum Drucken oder für den Datenexport)"]
[100,"Registerblatt \"E1_Projektdaten\"\nEingabe von Projektdaten, Termine, Investitionskosten, Förderung, Darlehen, Betriebskosten etc."]
[101,"allgemeine Informationen"]
["101a","Eingabefelder sind hellgelb unterlegt"]
["101b","Eingabefelder mit Standardwerten und/oder Berechnungen sind hellblau unterlegt\nBitte beachten Sie, dass das Überschreiben dieser Felder zu Fehlern an anderen Stellen und damit zu falschen Aussagen des Werkzeuges führen können."]
["101c","Eingabefelder in welche Daten aus der QMH Excel-Datei Situationserfassung übernommen werden können\nHinweis: Damit keine Formeln kopiert werden, ist die Funktion \"Einfügen - Werte\" zu wählen."]
["101d","Ausgabefelder, deren Inhalt kopiert werden und in einer externen Datei eingefügt werden können\nDie Felder sind überschreibbar. Bitte beachten Sie, dass das Überschreiben dieser Felder zu Fehlern an anderen Stellen und damit zu Fehlern führen können."]
["101e","Vorgabewert von blauen Eingabefeldern\nWert oder Formel kann bei Bedarf zur Wiederherstellung des Ausgangswertes in die zugehörige blaue Zelle übertragen können."]
["101k","Alle EUR - Beträge müssen ohne Mehrwertsteuer angegeben werden."]
[105,"Vorgabewerte oder -Formeln aus blauen Feldern\nAbweichungen werden in den blauen feldern gekennzeichnet."]
[106,"Eingabefeld für Name und Bezeichnung von Projekt und/oder Variante"]
[107,"Bearbeitende Person des Wirtschaftlichkeitsmodelles"]
[108,"Warnungen: Im Feld Warnungen erscheint ein kurzer Erläuterungstext, wenn bei der Eingabe unplausible Angaben gemacht werden (z.B. Netzverluste = 80% oder ähnlich)"]
[110,"Wärmemengen, Netzverluste und allgemeine Angaben zum Projekt"]
["110a","Maximal verkaufte Wärmemenge in MWh/a (Berechnet aus dem maximalen Wärmeabsatz aus der Spalte \"Wärmebedarf\" im Register \"B1_Berechnungen\" Pkt. 532 abzüglich Netzverluste Pkt. 110b"]
{"$rows_left_out":270}
{"sheet":"E1_Projektdaten","index":1,"n_rows":163,"n_cols":34,"rows_kept":163}
[100,"QM Holzheizwerke - Wirtschaftlichkeitsmodell - Projektdaten"]
[{"$nulls":10},105,null,105]
["101a",null,"Eingabefeld",{"$nulls":7},"Vorgabewerte",{"$nulls":3},"Bemerkungen",null,"Hinweise"]
["b",null,"Standardwert oder Berechnung (kann geändert werden)"]
["e",null,"Vorgabewert des Standardwertes"]
["101k","(exkl. MWST)"]
[]
[106,"Projekt/Variante:"]
[]
[]
[]
[107,"Erfasst von:"]
[]
[108,"Warnungen\nHinweise:",{"$f":"IF(W14>10,X15,IF(W14>0,X14,\"\"))","v":"Mehr als 10 Hinweise!"},{"$nulls":19},{"$f":"COUNTIF(U17:W164,\">0\")","v":21},{"$f":"_xlfn.TEXTJOIN(\", \",TRUE,X18:X164)","v":"110a: Der Gesamtwärmebezug ist sehr klein, 110c: Keine jährliche Abnahme des Wärmeabsatzes eingegeben., 110g: Das Jahr des Projektbeginns liegt vor 2000 , 115a: Der mit dem Holzkessel erzeugte Anteil an der Jahreswärmemenge ist gering, 115q: Der Jahresnutzungsgrad des fossilen Kessels ist sehr tief, 120e: Der Preis des fossilen Brennstoffs ist sehr tief, 120f: Der Strompreis ist sehr tief120f: Der Strompreis ist Null. , 125a: Die jährlichen Personalkosten sind sehr tief, 125b: Der jährlichen externen Betriebskosten sind sehr tief, 125c: Die jährlichen Unterhaltskosten sind sehr tief, 125g: Die jährlichen Grundstückskosten sind sehr tief, 125h: Die sonstigen Kosten sind sehr tief, 145a: Die Baukosten für die Heizzentrale sind sehr tief, 145b: Die Kosten für holzspezifische Anlagenteile sind sehr tief, 145h: Die Kosten für spitzenlastspezifische Anlagenteile sind sehr tief, 145i: Die Kosten für die Installationen in der Zentrale sind sehr tief, 145j: Die Baukosten für das Wärmenetz sind sehr tief, 145k: Die Kosten für die Wärmemessung sind sehr tief, 145l: Die Kosten für die Hausstationen sind sehr tief"}]
[{"$nulls":23},"Mehr als 10 Hinweise!","Es existieren Warnungen im Register 'E1_Projektdaten'!"]
[{"$nulls":18},"Min","Max","Unters.","Übers.","S.Fehler","Warnung","MinText","MaxText","SonstText"]
[110,"Wärmemengen, Netz, Projektstart"]
["a",null,"max. Gesamtwärmebezug der Abnehmer",{"$f":"SUM(E3_Verbraucher!$D$18:$XFD$18)","v":0},"MWh/a",{"$nulls":13},10,9999999999,{"$f":"IF($D18<S18,1,0)","v":1},{"$f":"IF($D18>T18,1,0)","v":0},null,{"$f":"IF(U18=1,Y18,IF(V18=1,Z18,IF(W18=1,AA18,\"\")))","v":"110a: Der Gesamtwärmebezug ist sehr klein"},"110a: Der Gesamtwärmebezug ist sehr klein","110a: Der Wärmebezug ist sehr gross"]
["b",null,"Netzverluste",10,"%",{"$nulls":5},10,{"$nulls":7},4,20,{"$f":"IF($D19<S19,1,0)","v":0},{"$f":"IF($D19>T19,1,0)","v":0},{"$f":"IF(D19=\"\",1,0)","v":0},{"$f":"IF(U19>0,Y19,\"\")&IF(V19>0,Z19,\"\")&IF(W19>0,AA19,\"\")","v":""},"110b: Die Netzverluste des Wärmenetzes sind sehr niedrig","110b: Die Netzverluste des Wärmenetzes sind sehr hoch","110b: Keine Netzverluste eingegeben."]
["c",null,"Abnahme des Wärmebedarfes (Effizienzsteigerung) ",null,"%",{"$nulls":13},0,5,{"$f":"IF($D20<S20,1,0)","v":0},{"$f":"IF($D20>T20,1,0)","v":0},{"$f":"IF(D20=\"\",1,0)","v":1},{"$f":"IF(U20>0,Y20,\"\")&IF(V20>0,Z20,\"\")&IF(W20>0,AA20,\"\")","v":"110c: Keine jährliche Abnahme des Wärmeabsatzes eingegeben."},"110c: Die Abnahme des Wärmeabsatzes der Wärmebezüger ist negativ; Mehrverbrauch. ","110c: Die jährliche Abnahme des Wärmeabsatzes ist sehr hoch. ","110c: Keine jährliche Abnahme des Wärmeabsatzes eingegeben."]
{"$rows_left_out":144}
{"sheet":"E2_Wärmepreis","index":2,"n_rows":49,"n_cols":11,"rows_kept":49,"merged":[[5,3,5,8],[6,3,6,8],[7,3,7,8],[9,3,9,8]]}
[200,"QM Holzheizwerke - Wirtschaftlichkeitsmodell - Wärmepreis "]
[]
["101a",null,null,"Eingabefeld"]
["101k","(exkl. MWST)"]
[]
[206,"Projekt/Variante:",null,{"$f":"IF(E1_Projektdaten!C8=0,\"\",E1_Projektdaten!C8)","v":""}]
[{"$nulls":3},{"$f":"IF(E1_Projektdaten!C9=0,\"\",E1_Projektdaten!C9)","v":""}]
[{"$nulls":3},{"$f":"IF(E1_Projektdaten!C10=0,\"\",E1_Projektdaten!C10)","v":""}]
[]
[207,"Erfasst von:",null,{"$f":"IF(E1_Projektdaten!C12=0,\"\",E1_Projektdaten!C12)","v":""}]
[]
[210,"Eingabe Grund- und Arbeitspreis",{"$nulls":8},"Bemerkungen"]
[]
[211,"Tarif 1",{"$nulls":4},{"$f":"SUMPRODUCT(E3_Verbraucher!$D$18:$XFD$18*(E3_Verbraucher!$D$22:$XFD$22=\"T 1: \"&Eing_Abnehmerart1))/max_verkaufteWM*100","v":{"$error":"#DIV/0!"}},"% der Wärmemenge"]
["a",{"$nulls":4},"jährlicher Grundpreis",null,"EUR/kW a"]
["b",{"$nulls":4},"Arbeitspreis",null,"EUR/kWh"]
["c",{"$nulls":4},"Vertragslaufzeit",null,"Jahre"]
[]
[]
[212,"Tarif 2",{"$nulls":4},{"$f":"SUMPRODUCT(E3_Verbraucher!$D$18:$XFD$18*(E3_Verbraucher!$D$22:$XFD$22=\"T 2: \"&Eing_Abnehmerart2))/max_verkaufteWM*100","v":{"$error":"#DIV/0!"}},"% der Wärmemenge"]
{"$rows_left_out":30}
{"sheet":"E3_Verbraucher","index":3,"n_rows":41,"n_cols":260,"rows_kept":41}
[300,"QM Holzheizwerke - Wirtschaftlichkeitsmodell - Eingabe Verbraucher"]
[]
["101a",null,"Eingabefeld"]
["101b",null,"Standardwert oder Berechnung (kann geändert werden)"]
["101c",null,"Feld für Übertrag aus Situationserfassung"]
[206,"Projekt/Variante:",{"$f":"IF(E1_Projektdaten!C8=0,\"\",E1_Projektdaten!C8)","v":""}]
[null,null,{"$f":"IF(E1_Projektdaten!C9=0,\"\",E1_Projektdaten!C9)","v":""}]
[null,null,{"$f":"IF(E1_Projektdaten!C10=0,\"\",E1_Projektdaten!C10)","v":""}]
[]
[207,"Erfasst von:",{"$f":"IF(E1_Projektdaten!C12=0,\"\",E1_Projektdaten!C12)","v":""}]
[]
[310,"Eingaben Verbraucher"]
[]
[311,"Allgemeines","Nummer"]
[312,null,"Bezeichnung"]
[null,null," "]
[null,null," "]
[320,"Wärmebedarf","Gesamtwärmebedarf [MWh/a]"]
[321,null,"abonnierte Leistung [kW]"]
[322,"Anschluss","Wärmebedarf im Anschlussjahr [%]"]
{"$rows_left_out":22}
{"sheet":"B1_Berechnungen","index":4,"n_rows":67,"n_cols":56,"rows_kept":67,"merged":[[2,3,2,8],[3,3,3,8],[5,3,5,8],[6,3,6,8],[7,3,7,8],[9,3,9,8],[11,3,11,8],[14,1,14,4],[15,2,15,4],[16,2,16,4],[17,2,17,4],[18,2,18,4],[19,2,19,4],[20,2,20,4],[21,2,21,4],[22,2,22,4],[23,2,23,4],[24,2,24,4],[31,2,31,4],[32,2,32,4]]}
[500,"QM Holzheizwerke - Wirtschaftlichkeitsmodell - Ergebnis"]
[]
["101a",null,null,"Eingabefeld"]
["101b",null,null,"Standardwert oder Berechnung (kann geändert werden)"]
[]
[206,"Projekt/Variante:",null,{"$f":"IF(E1_Projektdaten!C8=0,\"\",E1_Projektdaten!C8)","v":""},{"$nulls":5},505,"Wirtschaftliche Entwicklung (Diagramme)",{"$nulls":22},506,"Entwicklung Kreditstand / Restwert (Diagramm)"]
[{"$nulls":3},{"$f":"IF(E1_Projektdaten!C9=0,\"\",E1_Projektdaten!C9)","v":""}]
[{"$nulls":3},{"$f":"IF(E1_Projektdaten!C10=0,\"\",E1_Projektdaten!C10)","v":""}]
[]
[207,"Erfasst von:",null,{"$f":"IF(E1_Projektdaten!C12=0,\"\",E1_Projektdaten!C12)","v":""}]
[]
[501,"Warnungen:",null,{"$f":"IF(E1_Projektdaten!C14<>\"\",E1_Projektdaten!Y15,\"\")","v":"Es existieren Warnungen im Register 'E1_Projektdaten'!"}]
[{"$nulls":6},511]
[510,"Betriebskosten",null,null," (100% Auslastung; Jahr 1)"," [EUR/a]","Teuerung [%]"]
["a","Total Betriebskosten",{"$nulls":3},{"$f":"SUM(F16:F25)","v":0},{"$f":"IF(F15=0,0,SUMPRODUCT(F16:F25*G16:G25)/SUM(F16:F25))","v":{"v":0,"d":"0.00%"}}]
["b",null,"Brennstoff Biomasse",null,null,{"$f":"SUM(Energiekosten_Holzschnitzel,Energiekosten_WKK)","v":0},{"$f":"Eing_allg_Teuerung/100","v":{"v":0,"d":"0.00%"}}]
["c",null,"Energiekosten Zusatzwärmeerzeuger",null,null,{"$f":"Energiekosten_Zusatz","v":0},{"v":0,"d":"0.00%"}]
["d",null,"Energiekosten Abwärmenutzung",null,null,{"$f":"Energiekosten_AWN","v":0},{"$f":"Eing_allg_Teuerung/100","v":{"v":0,"d":"0.00%"}}]
["e",null,"Brennstoff fossil",null,null,{"$f":"Energiekosten_fossil","v":0},{"v":0,"d":"0.00%"}]
["f",null,"Strom (Hilfsenergie + WP)",null,null,{"$f":"SUM(Stromkosten_Hilfsenergie,Stromkosten_WP)","v":0},{"v":0,"d":"0.00%"}]
{"$rows_left_out":48}
{"sheet":"A1_Ergebnisse","index":5,"n_rows":44,"n_cols":14,"rows_kept":44,"merged":[[11,2,11,6],[43,7,59,12]]}
[600,"QM Holzheizwerke - Wirtschaftlichkeitsmodell - Ergebnisse",{"$nulls":5},"QM Holzheizwerke - Wirtschaftlichkeitsmodell - Ergebnisse"]
[]
["101a",null,"Eingabefeld",{"$nulls":4},"Energie",null,{"$f":"D34","v":0},{"$f":"E34","v":0},{"$f":"\"bis \"&B1_Berechnungen!B67","v":"bis 24"},null,650]
["101k","(exkl. MWST)",{"$nulls":6},"Netzauslastung",{"$f":"_xlfn.XLOOKUP(J$3,B1_Berechnungen!$B$43:$B$67,B1_Berechnungen!$D$43:$D$67)/100","v":{"v":0,"d":"0%"}},{"$f":"_xlfn.XLOOKUP(K$3,B1_Berechnungen!$B$43:$B$67,B1_Berechnungen!$D$43:$D$67)/100","v":{"v":0,"d":"0%"}},null,null,533]
[{"$nulls":8},"gelieferte Wärmemenge",{"$f":"_xlfn.XLOOKUP(J$3,B1_Berechnungen!$B$43:$B$67,B1_Berechnungen!$C$43:$C$67)*(100-Eing_Netzverluste)/100","v":0},{"$f":"_xlfn.XLOOKUP(K$3,B1_Berechnungen!$B$43:$B$67,B1_Berechnungen!$C$43:$C$67)*(100-Eing_Netzverluste)/100","v":0},{"$f":"SUM(B1_Berechnungen!C43:C67)*((100-Eing_Netzverluste))/100","v":0},"MWh/a",532]
[106,"Projekt/Variante:",{"$f":"IF(E1_Projektdaten!C8=0,\"\",E1_Projektdaten!C8)","v":""}]
[null,null,{"$f":"IF(E1_Projektdaten!C9=0,\"\",E1_Projektdaten!C9)","v":""},{"$nulls":4},"Entwicklung Netzauslastung",{"$nulls":5},655]
[null,null,{"$f":"IF(E1_Projektdaten!C10=0,\"\",E1_Projektdaten!C10)","v":""}]
[]
[107,"Erfasst von:",{"$f":"IF(E1_Projektdaten!C12=0,\"\",E1_Projektdaten!C12)","v":""}]
[]
[501,"Warnungen:",{"$f":"IF(E1_Projektdaten!C14<>\"\",E1_Projektdaten!Y15,\"\")","v":"Es existieren Warnungen im Register 'E1_Projektdaten'!"}]
[]
[110,"Wärmemengen, Netz, Projektstart"]
["a",null,"Gesamter Wärmebezug der Abnehmer",{"$f":"max_verkaufteWM","v":0},"MWh/a"]
["b",null,"Netzverluste",{"$f":"Eing_Netzverluste","v":10},"%"]
[]
["g",null,"Jahr des Projektbeginns",{"$f":"Eing_Beginnjahr","v":0}]
["h",null,"Jahr der Inbetriebnahme / erste Wärmelieferung",{"$f":"E1_Projektdaten!D23","v":0}]
[]
{"$rows_left_out":25}
{"sheet":"A2_Planerfolgsrechnung","index":6,"n_rows":43,"n_cols":29,"rows_kept":43,"merged":[[3,2,3,7],[12,2,12,6]]}
[700,"QM Holzheizwerke - Wirtschaftlichkeitsmodell - Planerfolgsrechnung"]
[]
["101a",null,"Eingabefeld"]
["101b",null,"Standardwert oder Berechnung (kann geändert werden)"]
["101k","(exkl. MWST)"]
[]
[106,"Projekt/Variante:",{"$f":"IF(E1_Projektdaten!C8=0,\"\",E1_Projektdaten!C8)","v":""}]
[null,null,{"$f":"IF(E1_Projektdaten!C9=0,\"\",E1_Projektdaten!C9)","v":""}]
[null,null,{"$f":"IF(E1_Projektdaten!C10=0,\"\",E1_Projektdaten!C10)","v":""}]
[]
[107,"Erfasst von:",{"$f":"IF(E1_Projektdaten!C12=0,\"\",E1_Projektdaten!C12)","v":""}]
[]
[501,"Warnungen:",{"$f":"IF(E1_Projektdaten!C14<>\"\",E1_Projektdaten!Y15,\"\")","v":"Es existieren Warnungen im Register 'E1_Projektdaten'!"}]
[]
[531,"Ertrag",null,null,{"$f":"TRANSPOSE(B1_Berechnungen!B$43:B$67)","v":0},1,2,3,4,5,6,7,8,9,10,11,12,13,14,15,16,17,18,19,20,21,22,23,24]
[561,null,"Wärmeverkauf\n(inkl. jährl. Grundpreis)","[EUR]",{"$f":"TRANSPOSE(B1_Berechnungen!N$43:N$67)","v":0},0,0,0,0,0,0,0,0,0,0,0,0,0,0,0,0,0,0,0,0,0,0,0,0]
[562,null,"Stromeinspeisung","[EUR]",{"$f":"TRANSPOSE(B1_Berechnungen!O$43:O$67)","v":0},0,0,0,0,0,0,0,0,0,0,0,0,0,0,0,0,0,0,0,0,0,0,0,0]
[563,null,"Pflanzenkohle","[EUR]",{"$f":"TRANSPOSE(B1_Berechnungen!P$43:P$67)","v":0},0,0,0,0,0,0,0,0,0,0,0,0,0,0,0,0,0,0,0,0,0,0,0,0]
[564,null,"Förderung\njährlich","[EUR]",{"$f":"TRANSPOSE(B1_Berechnungen!Q$43:Q$67)","v":0},0,0,0,0,0,0,0,0,0,0,0,0,0,0,0,0,0,0,0,0,0,0,0,0]
[566,null,"Zusätzlicher Ertrag","[EUR]",{"$f":"TRANSPOSE(B1_Berechnungen!R$43:R$67)","v":0},0,0,0,0,0,0,0,0,0,0,0,0,0,0,0,0,0,0,0,0,0,0,0,0]
{"$rows_left_out":24}
{"sheet":"A9_NPV-Daten","index":7,"n_rows":80,"n_cols":22,"rows_kept":80,"merged":[[6,2,7,2],[6,3,7,3],[6,4,7,4],[6,5,7,5]]}
[900,"QM Holzheizwerke - Zusammenstellung für KliK-Tool \"Nachweis der Zusätzlichkeit von Fernwärmeprojekten\""]
[]
[104,null,"Ausgabefelder"]
[]
[910,"Register Inputgrössen; Abschnitt Referenzentwicklung"]
[911,null,"Schlüsselkunden (oder Gruppe von Schlüsselkunden gleicher Charakteristik)"]
[null,null,"Bezeichnung","Gebäudetyp & Bezugscharakteristik","Leistung [kW]","Jahreswärmebedarf [MWh/a]"]
[]
[null,null,{"$f":"E3_Verbraucher!$D15","v":0},null,{"$f":"E3_Verbraucher!$D19","v":0},{"$f":"E3_Verbraucher!$D18","v":0}]
[null,null,{"$f":"E3_Verbraucher!$E15","v":0},null,{"$f":"E3_Verbraucher!$E19","v":0},{"$f":"E3_Verbraucher!$E18","v":0}]
[null,null,{"$f":"E3_Verbraucher!$F15","v":0},null,{"$f":"E3_Verbraucher!$F19","v":0},{"$f":"E3_Verbraucher!$F18","v":0}]
[null,null,{"$f":"E3_Verbraucher!$G15","v":0},null,{"$f":"E3_Verbraucher!$G19","v":0},{"$f":"E3_Verbraucher!$G18","v":0}]
[null,null,{"$f":"E3_Verbraucher!$H15","v":0},null,{"$f":"E3_Verbraucher!$H19","v":0},{"$f":"E3_Verbraucher!$H18","v":0}]
[null,null,{"$f":"E3_Verbraucher!$I15","v":0},null,{"$f":"E3_Verbraucher!$I19","v":0},{"$f":"E3_Verbraucher!$I18","v":0}]
[null,null,{"$f":"E3_Verbraucher!$J15","v":0},null,{"$f":"E3_Verbraucher!$J19","v":0},{"$f":"E3_Verbraucher!$J18","v":0}]
[null,null,{"$f":"E3_Verbraucher!$K15","v":0},null,{"$f":"E3_Verbraucher!$K19","v":0},{"$f":"E3_Verbraucher!$K18","v":0}]
[null,null,{"$f":"E3_Verbraucher!$L15","v":0},null,{"$f":"E3_Verbraucher!$L19","v":0},{"$f":"E3_Verbraucher!$L18","v":0}]
[null,null,{"$f":"E3_Verbraucher!$M15","v":0},null,{"$f":"E3_Verbraucher!$M19","v":0},{"$f":"E3_Verbraucher!$M18","v":0}]
[null,null,{"$f":"E3_Verbraucher!$N15","v":0},null,{"$f":"E3_Verbraucher!$N19","v":0},{"$f":"E3_Verbraucher!$N18","v":0}]
[null,null,{"$f":"E3_Verbraucher!$O15","v":0},null,{"$f":"E3_Verbraucher!$O19","v":0},{"$f":"E3_Verbraucher!$O18","v":0}]
{"$rows_left_out":60}