{"text_format":"3","workbook":"xlsx","n_sheets":7,"sheets":["I1_Erläuterung","E1_Projektdaten","E2_Wärmepreis","E3_Verbraucher","B1_Berechnungen","A1_Ergebnisse","A2_NPV-Daten"],"not_rendered":{"charts":6,"images":3,"defined_names":280,"comments":1},"read":"whole","date_system":"1900"}

{"sheet":"I1_Erläuterung","index":0,"n_rows":219,"n_cols":2,"rows_kept":219}
[null,"Erläuterungen zum QM Holzheizwerke Wirtschaftlichkeitstool"]
[null,"Version: 5.1 (Juni 2022)"]
[null,"Erläuterung"]
[null,"Prinzipielles zu diesem Werkzeug:\nHaftungsausschluss\nDas Excel-Werkzeug wurde sehr sorgfältig erstellt, trotzdem können die Hersteller keinerlei Garantie oder Gewährleistung für die ermittelten Ergebnisse und daraus abgeleitete Schlüsse übernehmen. Durch die getroffenen Vereinfachungen ergeben sich aufgrund der Art der Berechnung bestimmte \"Fehler\", z.B. wird nicht berücksichtigt, ob eine Zahlung zu Jahresbeginn oder Jahresende erfolgt, da ein Jahr als eine Periode angesehen wird.\nAchtung: Auch wenn Warnungs-Rückmeldungen bezüglich diverser Eingabegrenzen durch das Werkzeug erfolgen, ist nicht auszuschliessen, dass durch falsche Eingabewerte eine falsche Darstellung des Endergebnisses erfolgt. Die richtige Abschätzung der Folgen bestimmter Annahmen obliegt dem Benutzer des Werkzeugs.\n\nFormeln:\nDie Arbeitsblätter dieser Arbeitsmappe sind mit einem Schreibschutz gesichert, alle Formeln und Berechnungen sind jedoch ersichtlich. Bitte beachten Sie, dass Änderungen daran zu Fehlern an anderen Stellen und damit zu falschen Aussagen des Werkzeugs führen können.\n\nSensitivitätsanalyse / Was-Wäre-Wenn Rechnung:\nDurch Variation der Eingabeparameter und Speicherung der einzelnen Ergebnisse der \nWirtschaftlichkeitsberechnung ist es möglich, Aussagen bezüglich des Einflusses einzelner \nParameter auf die wirtschaftliche Entwicklung des Projekts zu erhalten.\n\nFeedback:\nDas Team von QM Holzheizwerke freut sich über Verbesserungsvorschläge und Anregungen zu \ndiesem Werkzeug, bitte übermitteln Sie diese an info@qmholzheizwerke.ch"]
[null,"Dank\nDie Erstellung des vorliegenden Werkzeuges erfolgte im Auftrag von Energieschweiz."]
[null,"Registerblätter: Die Datei ist aufgeteilt auf verschiedene Registerblätter\nBenennung: Die Benennung der Registerblätter unterscheidet auch die hauptsächliche Funktion des Arbeitsblattes:\nI = Information (Arbeitsblatt enthält Infos und Erläuterungen zur Anwendung der Datei)\nE = Eingabeblatt (Eingabe von Daten, die für die Berechnung notwendig sind)\nB = Berechnung\nA = Ausgabeblatt (Darstellung von ausgewählten Ergebnissen zum Drucken oder für den Datenexport)"]
[100,"Registerblatt \"E1_Projektdaten\"\nEingabe von Projektdaten, Termine, Investitionskosten, Förderung, Darlehen, Betriebskosten etc."]
[101,"Eingabefelder sind hellgelb unterlegt"]
[102,"Eingabefelder mit Standardwerten und/oder Berechnungen sind hellblau unterlegt\nBitte beachten Sie, dass das Überschreiben dieser Felder zu Fehlern an anderen Stellen und damit zu falschen Aussagen des Werkzeuges führen können."]
[103,"Eingabefelder in welche Daten aus der QMH Excel-Datei Situationserfassung übernommen werden können\nHinweis: Damit keine Formeln kopiert werden, ist die Funktion \"Einfügen - Werte\" zu wählen."]
[104,"Ausgabefelder, deren Inhalt kopiert werden und in einer externen Datei eingefügt werden können\nDie Felder sind überschreibbar. Bitte beachten Sie, dass das Überschreiben dieser Felder zu Fehlern an anderen Stellen und damit zu Fehlern führen können."]
[105,"Alle CHF - Beträge müssen ohne Mehrwertsteuer angegeben werden."]
[106,"Eingabefeld für Name und Bezeichnung von Projekt und/oder Variante"]
[107,"Bearbeitende Person des Wirtschaftlichkeitsmodelles"]
[108,"Warnungen: Im Feld Warnungen erscheint ein kurzer Erläuterungstext, wenn bei der Eingabe unplausible Angaben gemacht werden (z.B. Netzverluste = 80% oder ähnlich)"]
[110,"Kapitel Wärmemengen, Netzverluste und allgemeine Angaben zum Projekt"]
[111,"Verkaufte Wärmemenge in MWh bei einem Wärmeabnahmegrad von 100%. (Berechnet aus der Summe der Wärmebezüger aller Wärmeabnehmer im Register \"Verbraucher\""]
[112,"Netzverluste des Fernwärmenetzes (Q-Forderung QMH ≤10%). Verhältnis zwischen der Differenz der produzierten und der verkauften Wärmemenge zur verkauften Wärmemenge. Bei Netzen im Wachstum ist allenfalls ein mittlerer Verlust anzugeben."]
[113,"Jährliche Abnahme des Wärmebedarfes. Durchschnittliche jährliche Abnahme des Wärmebedarfes  durch Effizienzmassnahmen (z.B. verbesserte Gebäudehüllen) der Wärmebezüger ab der Inbetriebnahme. Dieser Wert wird im Gesamtwärmebedarf berücksichtigt."]
[114,"Basisjahr für Investitionen - wird als Jahr 0 für die Wirtschaftlichkeitsrechnung herangezogen"]
{"$rows_left_out":200}
{"sheet":"E1_Projektdaten","index":1,"n_rows":105,"n_cols":23,"rows_kept":105}
[100,"QM Holzheizwerke - Wirtschaftlichkeitsmodell - Projektdaten"]
[]
[101,null,"Eingabefeld",{"$nulls":9},"Bemerkungen"]
[102,null,"Standardwert oder Berechnung (kann geändert werden)"]
[105,"(exkl. MWST)"]
[]
[106,"Projekt/Variante:"]
[]
[]
[]
[107,"Erfasst von:"]
[]
[108,"Warnungen\nHinweise:",{"$f":"IF(S13>10,\"Mehr als 10 Hinweise!\",IF(S13>0,T13,\"\"))","v":"Mehr als 10 Hinweise!"},{"$nulls":15},{"$f":"COUNTIF(Q16:S120,\">0\")","v":21},{"$f":"T16&T24&T34&T47&T62&T74&T68","v":"111: Der Wärmebezug ist zu klein! 113: Keine jährliche Abnahme des Wärmeabsatzes eingegeben.114: Das Jahr des Projektbeginns liegt vor 2000. 122: Der mit Biomasse erzeugte Anteil an der Jahreswärmemenge ist gering. 124: Der Preis des fossilen Brennstoffs ist zu niedrig. 127:Der Strompreis wurde sehr niedrig angenommen. 127: Der Strompreis ist Null. 125: Der Jahresnutzungsgrad des Kessels ist unter 40 %. 130: Die jährlichen Personalkosten sind sehr niedrig. 131: Der jährlichen externen Betriebskosten sind sehr niedrig. 132: Die jährlichen Unterhaltskosten sind sehr niedrig. 135: Die jährlichen Grundstückskosten wurden sehr klein angenommen. 136: Die sonstigen Kosten sind sehr niedrig. 151: Die Baukosten für die Heizzentrale sind sehr niedrig. 154: Die Kosten für die Installationen in der Zentrale sind sehr niedrig. 155: Die Baukosten für das Wärmenetz sind sehr niedrig. 157: Die Kosten für die Hausstationen sind sehr niedrig. 152: Die Kosten für holzspezifische Anlagenteile sind sehr niedrig. 153: Die Kosten für spitzenlastspezifische Anlagenteile sind sehr niedrig. 156: Die Kosten für die Wärmemessung sind sehr niedrig. "}]
[]
[{"$nulls":14},"Min","Max","Unters.","Übers.","S.Fehler","Warnung","MinText","MaxText","SonstText"]
[110,"Wärmemengen, Netz, Projektstart",{"$nulls":17},{"$f":"T17&T18&T19&T21&T22","v":"111: Der Wärmebezug ist zu klein! 113: Keine jährliche Abnahme des Wärmeabsatzes eingegeben.114: Das Jahr des Projektbeginns liegt vor 2000. "}]
[111,null,"Gesamter Wärmebezug der Abnehmer",{"$f":"SUM(E3_Verbraucher!D18:XFD18)","v":0},"MWh/a",{"$nulls":9},10,9999999999,{"$f":"IF($D17<O17,1,0)","v":1},{"$f":"IF($D17>P17,1,0)","v":0},0,{"$f":"IF(Q17=1,U17,IF(R17=1,V17,IF(S17=1,W17,\"\")))","v":"111: Der Wärmebezug ist zu klein! "},"111: Der Wärmebezug ist zu klein! ","111: Der Wärmebezug ist zu gross. "]
[112,null,"Netzverluste",10,"%",{"$nulls":9},0,20,{"$f":"IF($D18<O18,1,0)","v":0},{"$f":"IF($D18>P18,1,0)","v":0},{"$f":"IF(D18=\"\",1,0)","v":0},{"$f":"IF(Q18>0,U18,\"\")&IF(R18>0,V18,\"\")&IF(S18>0,W18,\"\")","v":""},"112: Der Verlust des Wärmenetzes ist zu niedrig! ","112: Der Verlust des Wärmenetzes ist zu hoch! ","112: Keine Netzverluste eingegeben."]
[113,null,"Abnahme des Wärmebedarfes (Effizienzsteigerung) ",null,"%",{"$nulls":9},0,5,{"$f":"IF($D19<O19,1,0)","v":0},{"$f":"IF($D19>P19,1,0)","v":0},{"$f":"IF(D19=\"\",1,0)","v":1},{"$f":"IF(Q19>0,U19,\"\")&IF(R19>0,V19,\"\")&IF(S19>0,W19,\"\")","v":"113: Keine jährliche Abnahme des Wärmeabsatzes eingegeben."},"113: Die Abnahme des Wärmeabsatzes der Wärmebezüger ist negativ; Mehrverbrauch. ","113: Die jährliche Abnahme des Wärmeabsatzes ist sehr hoch. ","113: Keine jährliche Abnahme des Wärmeabsatzes eingegeben."]
[]
{"$rows_left_out":86}
{"sheet":"E2_Wärmepreis","index":2,"n_rows":35,"n_cols":11,"rows_kept":35,"merged":[[5,3,5,8],[6,3,6,8],[7,3,7,8],[9,3,9,8]]}
[200,"QM Holzheizwerke - Wirtschaftlichkeitsmodell - Wärmepreis "]
[]
[101,null,null,"Eingabefeld"]
[105,"(exkl. MWST)"]
[]
[206,"Projekt/Variante:",null,{"$f":"IF(E1_Projektdaten!C7=0,\"\",E1_Projektdaten!C7)","v":""}]
[{"$nulls":3},{"$f":"IF(E1_Projektdaten!C8=0,\"\",E1_Projektdaten!C8)","v":""}]
[{"$nulls":3},{"$f":"IF(E1_Projektdaten!C9=0,\"\",E1_Projektdaten!C9)","v":""}]
[]
[207,"Erfasst von:",null,{"$f":"IF(E1_Projektdaten!C11=0,\"\",E1_Projektdaten!C11)","v":""}]
[]
[210,"Eingabe Grund- und Arbeitspreis",{"$nulls":8},"Bemerkungen"]
[]
[211,"Tarif 1",{"$nulls":4},{"$f":"SUMPRODUCT(E3_Verbraucher!$D$18:$XFD$18*(E3_Verbraucher!$D$22:$XFD$22=\"T 1: \"&Eing_Abnehmerart1))/Eing_verkaufteWM*100","v":{"$error":"#DIV/0!"}},"% der Wärmemenge"]
[212,{"$nulls":4},"jährlicher Grundpreis",null,"CHF/kW a"]
[213,{"$nulls":4},"Arbeitspreis",null,"CHF/kWh"]
[214,{"$nulls":4},"Vertragslaufzeit",null,"Jahre"]
[]
[]
[221,"Tarif 2",{"$nulls":4},{"$f":"SUMPRODUCT(E3_Verbraucher!$D$18:$XFD$18*(E3_Verbraucher!$D$22:$XFD$22=\"T 2: \"&Eing_Abnehmerart2))/Eing_verkaufteWM*100","v":{"$error":"#DIV/0!"}},"% der Wärmemenge"]
{"$rows_left_out":16}
{"sheet":"E3_Verbraucher","index":3,"n_rows":38,"n_cols":183,"rows_kept":38}
[300,"QM Holzheizwerke - Wirtschaftlichkeitsmodell - Eingabe Verbraucher"]
[]
[101,null,"Eingabefeld"]
[102,null,"Standardwert oder Berechnung (kann geändert werden)"]
[103,null,"Feld für Übertrag aus Situationserfassung"]
[206,"Projekt/Variante:",{"$f":"IF(E1_Projektdaten!C7=0,\"\",E1_Projektdaten!C7)","v":""}]
[null,null,{"$f":"IF(E1_Projektdaten!C8=0,\"\",E1_Projektdaten!C8)","v":""}]
[null,null,{"$f":"IF(E1_Projektdaten!C9=0,\"\",E1_Projektdaten!C9)","v":""}]
[]
[207,"Erfasst von:",{"$f":"IF(E1_Projektdaten!C11=0,\"\",E1_Projektdaten!C11)","v":""}]
[]
[310,"Eingaben Verbraucher"]
[]
[311,"Allgemeines","Nummer"]
[312,null,"Bezeichnung"]
[null,null," "]
[null,null," "]
[320,"Wärmebedarf","Gesamtwärmebedarf [MWh/a]"]
[321,null,"abonnierte Leistung [kW]"]
[322,"Anschluss","Anschlusszeitpunkt"]
{"$rows_left_out":19}
{"sheet":"B1_Berechnungen","index":4,"n_rows":60,"n_cols":36,"rows_kept":60,"merged":[[2,3,2,8],[3,3,3,8],[5,3,5,8],[6,3,6,8],[7,3,7,8],[9,3,9,8],[11,3,11,8],[14,1,14,4],[15,2,15,4],[16,2,16,4],[17,2,17,4],[18,2,18,4],[19,2,19,4],[20,2,20,4],[21,2,21,4],[22,2,22,4],[26,2,26,4],[27,2,27,4],[28,2,28,4]]}
[500,"QM Holzheizwerke - Wirtschaftlichkeitsmodell - Ergebnis"]
[]
[101,null,null,"Eingabefeld"]
[102,null,null,"Standardwert oder Berechnung (kann geändert werden)"]
[]
[206,"Projekt/Variante:",null,{"$f":"IF(E1_Projektdaten!C7=0,\"\",E1_Projektdaten!C7)","v":""},{"$nulls":5},590,"Wirtschaftliche Entwicklung (Diagramm)",{"$nulls":10},591,"Entwicklung Kreditstand / Restwert (Diagramm)"]
[{"$nulls":3},{"$f":"IF(E1_Projektdaten!C8=0,\"\",E1_Projektdaten!C8)","v":""}]
[{"$nulls":3},{"$f":"IF(E1_Projektdaten!C9=0,\"\",E1_Projektdaten!C9)","v":""}]
[]
[207,"Erfasst von:",null,{"$f":"IF(E1_Projektdaten!C11=0,\"\",E1_Projektdaten!C11)","v":""}]
[]
[501,"Warnungen:",null,{"$f":"IF(E1_Projektdaten!C13<>\"\",\"Es existieren Warnungen im Register 'E1_Projektdaten'!\",\"\")","v":"Es existieren Warnungen im Register 'E1_Projektdaten'!"}]
[{"$nulls":6},505]
[510,"Betriebskosten",null,null," (100% Auslastung; Jahr 1)"," [CHF/a]","Teuerung [%]"]
[511,"Total Betriebskosten",{"$nulls":3},{"$f":"SUM(F16:F23)","v":0},{"$f":"IF(F15=0,0,(F16*G16+F17*G17+F19*G19+F18*G18+F20*G20+F21*G21+F22*G22+F23*G23)/(SUM(F16:F23)))","v":{"v":0,"d":"0.00%"}}]
[512,null,"Brennstoff Biomasse",null,null,{"$f":"Eing_Rohstoffpreis_Biomasse*Eingesetzte_Brennstoffwärme_Biomasse","v":0},{"$f":"Eing_allg_Teuerung/100","v":{"v":0,"d":"0.00%"}}]
[513,null,"Brennstoff fossil",null,null,{"$f":"Eingesetzte_Brennstoffwärme_fossil*Eing_Rohstoffpreis_fossil","v":0},{"v":0,"d":"0.00%"}]
[514,null,"Strom",null,null,{"$f":"järhliche_Stromkosten","v":0},{"v":0,"d":"0.00%"}]
[515,null,"Betriebskosten",null,null,{"$f":"Eing_Betriebskosten","v":0},{"v":0,"d":"0.00%"}]
[516,null,"Administration",null,null,{"$f":"Eing_Administration","v":0},{"$f":"Eing_allg_Teuerung/100","v":{"v":0,"d":"0.00%"}}]
{"$rows_left_out":41}
{"sheet":"A1_Ergebnisse","index":5,"n_rows":42,"n_cols":14,"rows_kept":42,"merged":[[11,2,11,6],[42,7,58,12]]}
[600,"QM Holzheizwerke - Wirtschaftlichkeitsmodell - Ergebnisse",{"$nulls":5},"QM Holzheizwerke - Wirtschaftlichkeitsmodell - Ergebnisse"]
[]
[101,null,"Eingabefeld",{"$nulls":4},"Energie",null,{"$f":"D32","v":0},{"$f":"E32","v":0},{"$f":"\"bis \"&B1_Berechnungen!B60","v":"bis 24"},null,650]
[105,"(exkl. MWST)",{"$nulls":6},"Netzauslastung",{"$f":"VLOOKUP(A1_Ergebnisse!J$3,B1_Berechnungen!$B$36:$AH$60,3)/100","v":{"v":0,"d":"0%"}},{"$f":"VLOOKUP(A1_Ergebnisse!K$3,B1_Berechnungen!$B$36:$AH$60,3)/100","v":{"v":0,"d":"0%"}},null,null,553]
[{"$nulls":8},"gelieferte Wärmemenge",{"$f":"(VLOOKUP(A1_Ergebnisse!J$3,B1_Berechnungen!$B$36:$AH$60,2))*((100-Eing_Netzverluste))/100","v":0},{"$f":"(VLOOKUP(A1_Ergebnisse!K$3,B1_Berechnungen!$B$36:$AH$60,2))*((100-Eing_Netzverluste))/100","v":0},{"$f":"SUM(B1_Berechnungen!C36:C60)*((100-Eing_Netzverluste))/100","v":0},"MWh/a",651]
[106,"Projekt/Variante:",{"$f":"IF(E1_Projektdaten!C7=0,\"\",E1_Projektdaten!C7)","v":""},{"$nulls":5},"mittlere Kosten bezogen auf Wärmeverkauf",{"$f":"(VLOOKUP(A1_Ergebnisse!J$3,B1_Berechnungen!$B$36:$AH$60,14))/J5","v":{"$error":"#DIV/0!"}},{"$f":"(VLOOKUP(A1_Ergebnisse!K$3,B1_Berechnungen!$B$36:$AH$60,14))/K5","v":{"$error":"#DIV/0!"}},{"$f":"SUM(B1_Berechnungen!O36:O60)/L5","v":{"$error":"#DIV/0!"}},"CHF/MWh",652]
[null,null,{"$f":"IF(E1_Projektdaten!C8=0,\"\",E1_Projektdaten!C8)","v":""}]
[null,null,{"$f":"IF(E1_Projektdaten!C9=0,\"\",E1_Projektdaten!C9)","v":""},{"$nulls":4},"Entwicklung Netzauslastung",{"$nulls":5},653]
[]
[107,"Erfasst von:",{"$f":"IF(E1_Projektdaten!C11=0,\"\",E1_Projektdaten!C11)","v":""}]
[]
[501,"Warnungen:",{"$f":"IF(E1_Projektdaten!C13<>\"\",\"Es existieren Warnungen im Register 'E1_Projektdaten'!\",\"\")","v":"Es existieren Warnungen im Register 'E1_Projektdaten'!"}]
[]
[110,"Wärmemengen, Netz, Projektstart"]
[111,null,"Gesamter Wärmebezug der Abnehmer",{"$f":"Eing_verkaufteWM","v":0},"MWh/a"]
[112,null,"Netzverluste",{"$f":"Eing_Netzverluste","v":10},"%"]
[]
[114,null,"Jahr des Projektbeginns",{"$f":"Eing_Beginnjahr","v":0}]
[115,null,"Jahr der Inbetriebnahme / erste Wärmelieferung",{"$f":"E1_Projektdaten!D22","v":0}]
[]
{"$rows_left_out":23}
{"sheet":"A2_NPV-Daten","index":6,"n_rows":80,"n_cols":22,"rows_kept":80,"merged":[[6,2,7,2],[6,3,7,3],[6,4,7,4],[6,5,7,5]]}
[900,"QM Holzheizwerke - Zusammenstellung für KliK-Tool \"Nachweis der Zusätzlichkeit von Fernwärmeprojekten\""]
[]
[104,null,"Ausgabefelder"]
[]
[910,"Register Inputgrössen; Abschnitt Referenzentwicklung"]
[911,null,"Schlüsselkunden (oder Gruppe von Schlüsselkunden gleicher Charakteristik)"]
[null,null,"Bezeichnung","Gebäudetyp & Bezugscharakteristik","Leistung [kW]","Jahreswärmebedarf [MWh/a]"]
[]
[null,null,{"$f":"E3_Verbraucher!$D15","v":0},null,{"$f":"E3_Verbraucher!$D19","v":0},{"$f":"E3_Verbraucher!$D18","v":0}]
[null,null,{"$f":"E3_Verbraucher!$E15","v":0},null,{"$f":"E3_Verbraucher!$E19","v":0},{"$f":"E3_Verbraucher!$E18","v":0}]
[null,null,{"$f":"E3_Verbraucher!$F15","v":0},null,{"$f":"E3_Verbraucher!$F19","v":0},{"$f":"E3_Verbraucher!$F18","v":0}]
[null,null,{"$f":"E3_Verbraucher!$G15","v":0},null,{"$f":"E3_Verbraucher!$G19","v":0},{"$f":"E3_Verbraucher!$G18","v":0}]
[null,null,{"$f":"E3_Verbraucher!$H15","v":0},null,{"$f":"E3_Verbraucher!$H19","v":0},{"$f":"E3_Verbraucher!$H18","v":0}]
[null,null,{"$f":"E3_Verbraucher!$I15","v":0},null,{"$f":"E3_Verbraucher!$I19","v":0},{"$f":"E3_Verbraucher!$I18","v":0}]
[null,null,{"$f":"E3_Verbraucher!$J15","v":0},null,{"$f":"E3_Verbraucher!$J19","v":0},{"$f":"E3_Verbraucher!$J18","v":0}]
[null,null,{"$f":"E3_Verbraucher!$K15","v":0},null,{"$f":"E3_Verbraucher!$K19","v":0},{"$f":"E3_Verbraucher!$K18","v":0}]
[null,null,{"$f":"E3_Verbraucher!$L15","v":0},null,{"$f":"E3_Verbraucher!$L19","v":0},{"$f":"E3_Verbraucher!$L18","v":0}]
[null,null,{"$f":"E3_Verbraucher!$M15","v":0},null,{"$f":"E3_Verbraucher!$M19","v":0},{"$f":"E3_Verbraucher!$M18","v":0}]
[null,null,{"$f":"E3_Verbraucher!$N15","v":0},null,{"$f":"E3_Verbraucher!$N19","v":0},{"$f":"E3_Verbraucher!$N18","v":0}]
[null,null,{"$f":"E3_Verbraucher!$O15","v":0},null,{"$f":"E3_Verbraucher!$O19","v":0},{"$f":"E3_Verbraucher!$O18","v":0}]
{"$rows_left_out":60}